Target
Adenosine deaminase
Ligand
BDBM50087378
Substrate
Meas. Tech.
ChEMBL_30792 (CHEMBL873051)
Ki
>7500±n/a nM
Citation
 Kasibhatla, SRBookser, BCProbst, GAppleman, JRErion, MD AMP deaminase inhibitors. 3. SAR of 3-(carboxyarylalkyl)coformycin aglycon analogues. J Med Chem 43:1508-18 (2000)  
Target
Name:
Adenosine deaminase
Synonyms:
ADA Adenosine aminohydrolase
Type:
Enzyme
Mol. Mass.:
40910.44
Organism:
Bos taurus (bovine)
Description:
Residue:
363
  
Inhibitor
Name:
BDBM50087378
Synonyms:
CHEMBL37074 | [3-(8-Hydroxy-7,8-dihydro-6H-imidazo[4,5-d][1,3]diazepin-3-ylmethyl)-phenyl]-acetic acid (2.0H2O)
Type:
Small organic molecule
Emp. Form.:
C15H16N4O3
Mol. Mass.:
300.3125
SMILES:
OC1CNC=Nc2c1ncn2Cc1cccc(CC(O)=O)c1
: