Target
AMP deaminase 3
Ligand
BDBM50087415
Substrate
Meas. Tech.
ChEMBL_28867 (CHEMBL644199)
Ki
7800±n/a nM
Citation
 Bookser, BCKasibhatla, SRErion, MD AMP deaminase inhibitors. 4. Further N3-substituted coformycin aglycon analogues: N3-alkylmalonates as ribose 5'-monophosphate mimetics. J Med Chem 43:1519-24 (2000)  
Target
Name:
AMP deaminase 3
Synonyms:
AMP deaminase 3 AMPD3 | AMPD3_HUMAN
Type:
Protein
Mol. Mass.:
88818.80
Organism:
Homo sapiens (Human)
Description:
Residue:
767
  
Inhibitor
Name:
BDBM50087415
Synonyms:
2-Carbamoyl-6-(8-hydroxy-7,8-dihydro-6H-imidazo[4,5-d][1,3]diazepin-3-yl)-2-methyl-hexanoic acid 0.75H2O.0.025CH3CO2H | CHEMBL288461
Type:
Small organic molecule
Emp. Form.:
C14H21N5O4
Mol. Mass.:
323.3476
SMILES:
CC(CCCCn1cnc2C(O)CNC=Nc12)(C(N)=O)C(O)=O
: