Target
Fructose-bisphosphate aldolase class 2
Ligand
BDBM75654
Substrate
Meas. Tech.
ChEMBL_1921621 (CHEMBL4424466)
Ki
880±n/a nM
Citation
 Xiao, SWei, LHong, ZRao, LRen, YWan, JFeng, L Design, synthesis and algicides activities of thiourea derivatives as the novel scaffold aldolase inhibitors. Bioorg Med Chem 27:805-812 (2019)  
Target
Name:
Fructose-bisphosphate aldolase class 2
Synonyms:
4.1.2.13 FBP aldolase Fructose-1,6-bisphosphate aldolase Fructose-bisphosphate aldolase class II fda | fda
Type:
PROTEIN
Mol. Mass.:
38964.97
Organism:
Synechocystis sp. (strain PCC 6803 / Kazusa)
Description:
ChEMBL_119070
Residue:
359
  
Inhibitor
Name:
BDBM75654
Synonyms:
4-Fluoro-N-[N'-(2-hydroxy-benzoyl)-hydrazinocarbothioyl]-benzamide 4-fluoro-N-[(salicyloylamino)thiocarbamoyl]benzamide 4-fluoro-N-[[[(2-hydroxyphenyl)-oxomethyl]hydrazo]-sulfanylidenemethyl]benzamide SMR000516924 | cid_1933071
Type:
Small organic molecule
Emp. Form.:
C15H12FN3O3S
Mol. Mass.:
333.337
SMILES:
Oc1ccccc1C(=O)NNC(=S)NC(=O)c1ccc(F)cc1
: