Target
Fructose-bisphosphate aldolase class 2
Ligand
BDBM50531938
Substrate
Meas. Tech.
ChEMBL_1921621 (CHEMBL4424466)
Ki
5500±n/a nM
Citation
 Xiao, SWei, LHong, ZRao, LRen, YWan, JFeng, L Design, synthesis and algicides activities of thiourea derivatives as the novel scaffold aldolase inhibitors. Bioorg Med Chem 27:805-812 (2019)  
Target
Name:
Fructose-bisphosphate aldolase class 2
Synonyms:
4.1.2.13 FBP aldolase Fructose-1,6-bisphosphate aldolase Fructose-bisphosphate aldolase class II fda | fda
Type:
PROTEIN
Mol. Mass.:
38964.97
Organism:
Synechocystis sp. (strain PCC 6803 / Kazusa)
Description:
ChEMBL_119070
Residue:
359
  
Inhibitor
Name:
BDBM50531938
Synonyms:
CHEMBL4455886
Type:
Small organic molecule
Emp. Form.:
C15H13N3O4S
Mol. Mass.:
331.346
SMILES:
Cc1ccc(cc1)C(=O)NC(=S)Nc1ccc(cc1O)[N+]([O-])=O
: