Target
Lysine-specific demethylase 5B
Ligand
BDBM50532176
Substrate
Meas. Tech.
ChEMBL_1921939 (CHEMBL4424784)
IC50
1.3±n/a nM
Citation
 Miyake, YItoh, YHatanaka, ASuzuma, YSuzuki, MKodama, HArai, YSuzuki, T Identification of novel lysine demethylase 5-selective inhibitors by inhibitor-based fragment merging strategy. Bioorg Med Chem 27:1119-1129 (2019)  
Target
Name:
Lysine-specific demethylase 5B
Synonyms:
CT31 Histone demethylase JARID1B Jumonji/ARID domain-containing protein 1B KDM5B_HUMAN Lysine-specific demethylase 5B (KDM5Flag-5B-FL) PLU1 RBP2-H1 | Retinoblastoma-binding protein 2 homolog 1
Type:
Protein
Mol. Mass.:
175659.67
Organism:
Homo sapiens (Human)
Description:
Q9UGL1
Residue:
1544
  
Inhibitor
Name:
BDBM50532176
Synonyms:
CHEMBL4542928
Type:
Small organic molecule
Emp. Form.:
C25H33N5O
Mol. Mass.:
419.5624
SMILES:
CCCCCCN(C)CCc1ccc(cc1)-c1[nH]c2c(cnn2c(=O)c1C(C)C)C#N
: