Target
Matrix metalloproteinase-9
Ligand
BDBM50088126
Substrate
Meas. Tech.
ChEMBL_105390 (CHEMBL710809)
Ki
0.500000±n/a nM
Citation
 Scozzafava, ASupuran, CT Protease inhibitors: synthesis of potent bacterial collagenase and matrix metalloproteinase inhibitors incorporating N-4-nitrobenzylsulfonylglycine hydroxamate moieties. J Med Chem 43:1858-65 (2000)  
Target
Name:
Matrix metalloproteinase-9
Synonyms:
67 kDa matrix metalloproteinase-9 92 kDa gelatinase CLG4B Gelatinase B MMP9 Matrix metalloproteinase 9 (MMP-9) Matrix metalloproteinase-9 (MMP9)
Type:
Enzyme
Mol. Mass.:
78452.28
Organism:
Homo sapiens (Human)
Description:
P14780
Residue:
707
  
Inhibitor
Name:
BDBM50088126
Synonyms:
CHEMBL293528 | N-Hydroxy-2-[(4-nitro-benzyl)-(4-(N-(4-methyl-benzene)-sulfonyl)ureido-benzenesulfonyl)-amino]-acetamide
Type:
Small organic molecule
Emp. Form.:
C23H23N5O9S2
Mol. Mass.:
577.587
SMILES:
Cc1ccc(cc1)S(=O)(=O)NC(=O)Nc1ccc(cc1)S(=O)(=O)N(CC(=O)NO)Cc1ccc(cc1)[N+]([O-])=O
: