Target
72 kDa type IV collagenase
Ligand
BDBM50088107
Substrate
Meas. Tech.
ChEMBL_104538 (CHEMBL718925)
Ki
0.600000±n/a nM
Citation
 Scozzafava, ASupuran, CT Protease inhibitors: synthesis of potent bacterial collagenase and matrix metalloproteinase inhibitors incorporating N-4-nitrobenzylsulfonylglycine hydroxamate moieties. J Med Chem 43:1858-65 (2000)  
Target
Name:
72 kDa type IV collagenase
Synonyms:
72 kDa gelatinase CLG4A Gelatinase A (MMP-2) MMP2_HUMAN Matrix metalloproteinase-2 (MMP 2) Matrix metalloproteinases 2 (MMP-2) | TBE-1
Type:
Enzyme
Mol. Mass.:
73870.36
Organism:
Homo sapiens (Human)
Description:
P08253
Residue:
660
  
Inhibitor
Name:
BDBM50088107
Synonyms:
CHEMBL293357 | N-Hydroxy-2-[(4-nitro-benzyl)-(4-(N-(4-Fluorobenzene)-sulfonyl)ureido-benzenesulfonyl)-amino]-acetamide
Type:
Small organic molecule
Emp. Form.:
C22H20FN5O9S2
Mol. Mass.:
581.551
SMILES:
ONC(=O)CN(Cc1ccc(cc1)[N+]([O-])=O)S(=O)(=O)c1ccc(NC(=O)NS(=O)(=O)c2ccc(F)cc2)cc1
: