Target
Interstitial collagenase
Ligand
BDBM50088130
Substrate
Meas. Tech.
ChEMBL_106145 (CHEMBL718692)
Ki
18±n/a nM
Citation
 Scozzafava, ASupuran, CT Protease inhibitors: synthesis of potent bacterial collagenase and matrix metalloproteinase inhibitors incorporating N-4-nitrobenzylsulfonylglycine hydroxamate moieties. J Med Chem 43:1858-65 (2000)  
Target
Name:
Interstitial collagenase
Synonyms:
CLG MMP1 Matrix metalloproteinase-1 | Matrix metalloproteinase-1 (MMP-1)
Type:
Enzyme
Mol. Mass.:
54010.26
Organism:
Homo sapiens (Human)
Description:
P03956
Residue:
469
  
Inhibitor
Name:
BDBM50088130
Synonyms:
CHEMBL53044 | N-Hydroxy-2-[(3-nitro-benzenesulfonyl)-(4-nitro-benzyl)-amino]-acetamide
Type:
Small organic molecule
Emp. Form.:
C15H14N4O8S
Mol. Mass.:
410.359
SMILES:
ONC(=O)CN(Cc1ccc(cc1)[N+]([O-])=O)S(=O)(=O)c1cccc(c1)[N+]([O-])=O
: