Target
72 kDa type IV collagenase
Ligand
BDBM50088130
Substrate
Meas. Tech.
ChEMBL_104538 (CHEMBL718925)
Ki
12±n/a nM
Citation
 Scozzafava, ASupuran, CT Protease inhibitors: synthesis of potent bacterial collagenase and matrix metalloproteinase inhibitors incorporating N-4-nitrobenzylsulfonylglycine hydroxamate moieties. J Med Chem 43:1858-65 (2000)  
Target
Name:
72 kDa type IV collagenase
Synonyms:
72 kDa gelatinase CLG4A Gelatinase A (MMP-2) MMP2_HUMAN Matrix metalloproteinase-2 (MMP 2) Matrix metalloproteinases 2 (MMP-2) | TBE-1
Type:
Enzyme
Mol. Mass.:
73870.36
Organism:
Homo sapiens (Human)
Description:
P08253
Residue:
660
  
Inhibitor
Name:
BDBM50088130
Synonyms:
CHEMBL53044 | N-Hydroxy-2-[(3-nitro-benzenesulfonyl)-(4-nitro-benzyl)-amino]-acetamide
Type:
Small organic molecule
Emp. Form.:
C15H14N4O8S
Mol. Mass.:
410.359
SMILES:
ONC(=O)CN(Cc1ccc(cc1)[N+]([O-])=O)S(=O)(=O)c1cccc(c1)[N+]([O-])=O
: