Target
Thymidylate synthase
Ligand
BDBM50408871
Substrate
Meas. Tech.
ChEMBL_209985 (CHEMBL821413)
Ki
1.7±n/a nM
Citation
 Bavetsias, VMarriott, JHMelin, CKimbell, RMatusiak, ZSBoyle, FTJackman, AL Design and synthesis of Cyclopenta[g]quinazoline-based antifolates as inhibitors of thymidylate synthase and potential antitumor agents(,). J Med Chem 43:1910-26 (2000)  
Target
Name:
Thymidylate synthase
Synonyms:
TS TYSY_MOUSE | Tyms
Type:
PROTEIN
Mol. Mass.:
34957.15
Organism:
Mus musculus
Description:
ChEMBL_1340097
Residue:
307
  
Inhibitor
Name:
BDBM50408871
Synonyms:
CHEMBL60700
Type:
Small organic molecule
Emp. Form.:
C29H28N8O6
Mol. Mass.:
584.5826
SMILES:
Cc1nc2cc3CCC(N(CC#C)c4ccc(cc4)C(=O)N[C@@H](CCc4nnn(CC(O)=O)n4)C(O)=O)c3cc2c(=O)[nH]1
: