Target
Alpha-1D adrenergic receptor
Ligand
BDBM50088409
Substrate
Meas. Tech.
ChEMBL_32438 (CHEMBL646099)
Ki
10±n/a nM
Citation
 Kuo, GHProuty, CMurray, WVPulito, VJolliffe, LCheung, PVarga, SEvangelisto, MWang, J Design, synthesis, and structure-activity relationships of phthalimide-phenylpiperazines: a novel series of potent and selective alpha(1)(a)-adrenergic receptor antagonists. J Med Chem 43:2183-95 (2000)  
Target
Name:
Alpha-1D adrenergic receptor
Synonyms:
ADA1D_HUMAN ADRA1D Adrenergic receptor alpha Alpha 1D-adrenoreceptor Alpha-1D adrenoceptor adrenergic Alpha1D
Type:
Enzyme Catalytic Domain
Mol. Mass.:
60485.82
Organism:
Homo sapiens (Human)
Description:
adrenergic Alpha1D ADRA1D HUMAN::P25100
Residue:
572
  
Inhibitor
Name:
BDBM50088409
Synonyms:
2-(4-Hydroxy-phenyl)-1,3-dioxo-2,3-dihydro-1H-isoindole-5-carboxylic acid {3-[4-(2-isopropoxy-phenyl)-piperazin-1-yl]-propyl}-amide | CHEMBL70892
Type:
Small organic molecule
Emp. Form.:
C31H34N4O5
Mol. Mass.:
542.6255
SMILES:
CC(C)Oc1ccccc1N1CCN(CCCNC(=O)c2ccc3C(=O)N(C(=O)c3c2)c2ccc(O)cc2)CC1
: