Target
Coagulation factor X
Ligand
BDBM50532742
Substrate
Meas. Tech.
ChEMBL_1923730 (CHEMBL4426686)
Ki
>17000±n/a nM
Citation
 Andersson, VBergström, FBrånalt, JGrönberg, GGustafsson, DKarlsson, SPolla, MBergman, JKihlberg, J Macrocyclic Prodrugs of a Selective Nonpeptidic Direct Thrombin Inhibitor Display High Permeability, Efficient Bioconversion but Low Bioavailability. J Med Chem 59:6658-70 (2016)  
Target
Name:
Coagulation factor X
Synonyms:
Activated coagulation factor X (FXa) Coagulation factor X precursor F10 Factor X heavy chain Factor Xa Stuart-Prower factor
Type:
Enzyme
Mol. Mass.:
54726.60
Organism:
Homo sapiens (Human)
Description:
Residue:
488
  
Inhibitor
Name:
BDBM50532742
Synonyms:
CHEMBL4455063
Type:
Small organic molecule
Emp. Form.:
C23H27ClN4O2
Mol. Mass.:
426.939
SMILES:
CC1=C(CC(=O)NCc2cc(Cl)ccc2CN)C(=O)N(CC1)NCc1ccccc1
: