Target
Serine protease 1
Ligand
BDBM50532741
Substrate
Meas. Tech.
ChEMBL_1923727 (CHEMBL4426683)
Ki
>5400±n/a nM
Citation
 Andersson, VBergström, FBrånalt, JGrönberg, GGustafsson, DKarlsson, SPolla, MBergman, JKihlberg, J Macrocyclic Prodrugs of a Selective Nonpeptidic Direct Thrombin Inhibitor Display High Permeability, Efficient Bioconversion but Low Bioavailability. J Med Chem 59:6658-70 (2016)  
Target
Name:
Serine protease 1
Synonyms:
Alpha-trypsin chain 1 Beta-trypsin PRSS1 TRP1 TRY1_HUMAN Thrombin & trypsin Trypsin I | Trypsin-1
Type:
Enzyme
Mol. Mass.:
26557.80
Organism:
Homo sapiens (Human)
Description:
P07477
Residue:
247
  
Inhibitor
Name:
BDBM50532741
Synonyms:
CHEMBL4443619
Type:
Small organic molecule
Emp. Form.:
C24H27ClN4O4
Mol. Mass.:
470.949
SMILES:
CC1=C(CC(=O)NCc2cc(Cl)ccc2CN)C(=O)N(CC1)NCc1cccc(c1)C(O)=O
: