Target
Prothrombin
Ligand
BDBM50532742
Substrate
Meas. Tech.
ChEMBL_1923726 (CHEMBL4426682)
Ki
0.500000±n/a nM
Citation
 Andersson, VBergström, FBrånalt, JGrönberg, GGustafsson, DKarlsson, SPolla, MBergman, JKihlberg, J Macrocyclic Prodrugs of a Selective Nonpeptidic Direct Thrombin Inhibitor Display High Permeability, Efficient Bioconversion but Low Bioavailability. J Med Chem 59:6658-70 (2016)  
Target
Name:
Prothrombin
Synonyms:
Activation peptide fragment 1 Coagulation factor II Prothrombin precursor Thrombin heavy chain | Thrombin light chain
Type:
Protein
Mol. Mass.:
70029.57
Organism:
Homo sapiens (Human)
Description:
P00734
Residue:
622
  
Inhibitor
Name:
BDBM50532742
Synonyms:
CHEMBL4455063
Type:
Small organic molecule
Emp. Form.:
C23H27ClN4O2
Mol. Mass.:
426.939
SMILES:
CC1=C(CC(=O)NCc2cc(Cl)ccc2CN)C(=O)N(CC1)NCc1ccccc1
: