Target
Mast/stem cell growth factor receptor Kit
Ligand
BDBM50533694
Substrate
Meas. Tech.
ChEMBL_1926538 (CHEMBL4429610)
EC50
<100±n/a nM
Citation
 Li, BWang, ALiu, JQi, ZLiu, XYu, KWu, HChen, CHu, CWang, WWu, JHu, ZYe, LZou, FLiu, FWang, BWang, LRen, TZhang, SBai, MZhang, SLiu, JLiu, Q Discovery of N-((1-(4-(3-(3-((6,7-Dimethoxyquinolin-3-yl)oxy)phenyl)ureido)-2-(trifluoromethyl)phenyl)piperidin-4-yl)methyl)propionamide (CHMFL-KIT-8140) as a Highly Potent Type II Inhibitor Capable of Inhibiting the T670I "Gatekeeper" Mutant of cKIT Kinase. J Med Chem 59:8456-72 (2016)  
Target
Name:
Mast/stem cell growth factor receptor Kit
Synonyms:
CD117 antigen KIT Mast/stem cell growth factor receptor Kit (cKIT) Proto-oncogene tyrosine-protein kinase Kit Stem cell growth factor receptor Tyrosine-protein kinase Kit c-kit v-kit Hardy-Zuckerman 4 feline sarcoma viral oncogene homolog
Type:
Protein
Mol. Mass.:
109869.37
Organism:
Homo sapiens (Human)
Description:
P10721
Residue:
976
  
Inhibitor
Name:
BDBM50533694
Synonyms:
CHEMBL4445808
Type:
Small organic molecule
Emp. Form.:
C34H36F3N5O5
Mol. Mass.:
651.6753
SMILES:
CCC(=O)NCC1CCN(CC1)c1ccc(NC(=O)Nc2cccc(Oc3ccnc4cc(OC)c(OC)cc34)c2)cc1C(F)(F)F
: