Target
Peroxisome proliferator-activated receptor alpha
Ligand
BDBM50534030
Substrate
Meas. Tech.
ChEMBL_1927650 (CHEMBL4430722)
EC50
33±n/a nM
Citation
 Okazaki, SShioi, RNoguchi-Yachide, TIshikawa, MMakishima, MHashimoto, YYamaguchi, T Structure-activity relationship studies of non-carboxylic acid peroxisome proliferator-activated receptor ?/? (PPAR?/?) dual agonists. Bioorg Med Chem 24:5455-5461 (2016)  
Target
Name:
Peroxisome proliferator-activated receptor alpha
Synonyms:
NR1C1 PPAR PPAR-alpha PPARA_HUMAN Peroxisome proliferator-activated receptor | Peroxisome proliferator-activated receptor alpha (PPAR alpha)
Type:
Enzyme
Mol. Mass.:
52222.08
Organism:
Homo sapiens (Human)
Description:
Q07869
Residue:
468
  
Inhibitor
Name:
BDBM50534030
Synonyms:
CHEMBL4528723
Type:
Small organic molecule
Emp. Form.:
C25H23N3O4
Mol. Mass.:
429.4678
SMILES:
CC(NC(C)=O)c1nc(no1)-c1ccc(Oc2ccc(OCc3ccccc3)cc2)cc1
: