Target
Peroxisome proliferator-activated receptor delta
Ligand
BDBM28661
Substrate
Meas. Tech.
ChEMBL_1927651 (CHEMBL4430723)
EC50
5.9±n/a nM
Citation
 Okazaki, SShioi, RNoguchi-Yachide, TIshikawa, MMakishima, MHashimoto, YYamaguchi, T Structure-activity relationship studies of non-carboxylic acid peroxisome proliferator-activated receptor ?/? (PPAR?/?) dual agonists. Bioorg Med Chem 24:5455-5461 (2016)  
Target
Name:
Peroxisome proliferator-activated receptor delta
Synonyms:
NR1C2 NUCI Nuclear receptor subfamily 1 group C member 2 PPAR-beta PPARD Peroxisome proliferator-activated receptor Peroxisome proliferator-activated receptor delta
Type:
Enzyme
Mol. Mass.:
49910.45
Organism:
Homo sapiens (Human)
Description:
Q03181
Residue:
441
  
Inhibitor
Name:
BDBM28661
Synonyms:
2-{2-methyl-4-[({4-methyl-2-[4-(trifluoromethyl)phenyl]-1,3-thiazol-5-yl}methyl)sulfanyl]phenoxy}acetic acid GW 501516 GW1516 | GW501516
Type:
Small organic molecule
Emp. Form.:
C21H18F3NO3S2
Mol. Mass.:
453.498
SMILES:
Cc1nc(sc1CSc1ccc(OCC(O)=O)c(C)c1)-c1ccc(cc1)C(F)(F)F
: