Target
Peroxisome proliferator-activated receptor delta
Ligand
BDBM29080
Substrate
Meas. Tech.
ChEMBL_1927655 (CHEMBL4430727)
EC50
1100±n/a nM
Citation
 Okazaki, SShioi, RNoguchi-Yachide, TIshikawa, MMakishima, MHashimoto, YYamaguchi, T Structure-activity relationship studies of non-carboxylic acid peroxisome proliferator-activated receptor ?/? (PPAR?/?) dual agonists. Bioorg Med Chem 24:5455-5461 (2016)  
Target
Name:
Peroxisome proliferator-activated receptor delta
Synonyms:
NR1C2 NUCI Nuclear receptor subfamily 1 group C member 2 PPAR-beta PPARD Peroxisome proliferator-activated receptor Peroxisome proliferator-activated receptor delta
Type:
Enzyme
Mol. Mass.:
49910.45
Organism:
Homo sapiens (Human)
Description:
Q03181
Residue:
441
  
Inhibitor
Name:
BDBM29080
Synonyms:
CHEMBL280065 Oleamide MEA Oleoylethanolamide (OEA)
Type:
Emp. Form.:
C20H39NO2
Mol. Mass.:
325.5292
SMILES:
CCCCCCCC\C=C/CCCCCCCC(=O)NCCO
: