Target
Peroxisome proliferator-activated receptor delta
Ligand
BDBM50534031
Substrate
Meas. Tech.
ChEMBL_1927651 (CHEMBL4430723)
EC50
290±n/a nM
Citation
 Okazaki, SShioi, RNoguchi-Yachide, TIshikawa, MMakishima, MHashimoto, YYamaguchi, T Structure-activity relationship studies of non-carboxylic acid peroxisome proliferator-activated receptor ?/? (PPAR?/?) dual agonists. Bioorg Med Chem 24:5455-5461 (2016)  
Target
Name:
Peroxisome proliferator-activated receptor delta
Synonyms:
NR1C2 NUCI Nuclear receptor subfamily 1 group C member 2 PPAR-beta PPARD Peroxisome proliferator-activated receptor Peroxisome proliferator-activated receptor delta
Type:
Enzyme
Mol. Mass.:
49910.45
Organism:
Homo sapiens (Human)
Description:
Q03181
Residue:
441
  
Inhibitor
Name:
BDBM50534031
Synonyms:
CHEMBL4454087
Type:
Small organic molecule
Emp. Form.:
C25H23N3O5
Mol. Mass.:
445.4672
SMILES:
COC(=O)NC(C)c1nc(no1)-c1ccc(Oc2ccc(OCc3ccccc3)cc2)cc1
: