Target
Peroxisome proliferator-activated receptor gamma
Ligand
BDBM50428854
Substrate
Meas. Tech.
ChEMBL_1927649 (CHEMBL4430721)
Ki
10.0±n/a nM
Citation
 Okazaki, SShioi, RNoguchi-Yachide, TIshikawa, MMakishima, MHashimoto, YYamaguchi, T Structure-activity relationship studies of non-carboxylic acid peroxisome proliferator-activated receptor ?/? (PPAR?/?) dual agonists. Bioorg Med Chem 24:5455-5461 (2016)  
Target
Name:
Peroxisome proliferator-activated receptor gamma
Synonyms:
NR1C3 PPAR-gamma PPARG_HUMAN Peroxisome proliferator-activated receptor gamma (PPAR gamma) Peroxisome proliferator-activated receptor gamma (PPARĪ³) peroxisome proliferator-activated receptor gamma isoform 2
Type:
Nuclear Receptor
Mol. Mass.:
57613.46
Organism:
Homo sapiens (Human)
Description:
P37231
Residue:
505
  
Inhibitor
Name:
BDBM50428854
Synonyms:
CHEMBL1236924
Type:
Small organic molecule
Emp. Form.:
C21H12Cl4N2O3S
Mol. Mass.:
514.209
SMILES:
Clc1ccc(c(Cl)c1)S(=O)(=O)Nc1cc(Cl)c(Oc2cnc3ccccc3c2)c(Cl)c1
: