Target
Mu-type opioid receptor
Ligand
BDBM50142692
Substrate
Meas. Tech.
ChEMBL_1927696 (CHEMBL4430768)
Ki
0.830000±n/a nM
Citation
 Ronsisvalle, SAricò, GPanarello, FSpadaro, APasquinucci, LPappalardo, MSParenti, CRonsisvalle, N An LP1 analogue, selective MOR agonist with a peculiar pharmacological profile, used to scrutiny the ligand binding domain. Bioorg Med Chem 24:5280-5290 (2016)  
Target
Name:
Mu-type opioid receptor
Synonyms:
M-OR-1 MOR-1 MUOR1 Mu opiate receptor OPRM1 hMOP | mu-type opioid receptor isoform MOR-1
Type:
G Protein-Coupled Receptor (GPCR)
Mol. Mass.:
44789.51
Organism:
Homo sapiens (Human)
Description:
P35372
Residue:
400
  
Inhibitor
Name:
BDBM50142692
Synonyms:
CHEMBL3759092
Type:
Small organic molecule
Emp. Form.:
C23H28N2O2
Mol. Mass.:
364.4806
SMILES:
[H][C@]12Cc3ccc(O)cc3[C@](C)(CCN1CCC(=O)Nc1ccccc1)[C@H]2C
: