Target
Mu-type opioid receptor
Ligand
BDBM50534068
Substrate
Meas. Tech.
ChEMBL_1927699 (CHEMBL4430771)
Ki
6.0±n/a nM
Citation
 Ronsisvalle, SAricò, GPanarello, FSpadaro, APasquinucci, LPappalardo, MSParenti, CRonsisvalle, N An LP1 analogue, selective MOR agonist with a peculiar pharmacological profile, used to scrutiny the ligand binding domain. Bioorg Med Chem 24:5280-5290 (2016)  
Target
Name:
Mu-type opioid receptor
Synonyms:
M-OR-1 MOR-1 MUOR1 Mu opiate receptor OPRM1 hMOP | mu-type opioid receptor isoform MOR-1
Type:
G Protein-Coupled Receptor (GPCR)
Mol. Mass.:
44789.51
Organism:
Homo sapiens (Human)
Description:
P35372
Residue:
400
  
Inhibitor
Name:
BDBM50534068
Synonyms:
CHEMBL4466859
Type:
Small organic molecule
Emp. Form.:
C22H30N2O2S
Mol. Mass.:
386.551
SMILES:
COc1ccsc1CNCC[C@]1(CCC2(CCCC2)OC1)c1ccccn1
: