Target
Tyrosyl-DNA phosphodiesterase 1
Ligand
BDBM60996
Substrate
Meas. Tech.
ChEMBL_1928068 (CHEMBL4431140)
IC50
22±n/a nM
Citation
 Laev, SSSalakhutdinov, NFLavrik, OI Tyrosyl-DNA phosphodiesterase inhibitors: Progress and potential. Bioorg Med Chem 24:5017-5027 (2016)  
Target
Name:
Tyrosyl-DNA phosphodiesterase 1
Synonyms:
TDP1 Tyrosyl-DNA phosphodiesterase 1 | Tyrosyl-DNA phosphodiesterase 1 (TDP1)
Type:
Enzyme
Mol. Mass.:
68430.66
Organism:
Homo sapiens (Human)
Description:
Q9NUW8
Residue:
608
  
Inhibitor
Name:
BDBM60996
Synonyms:
5-[(3-carboxy-4-hydroxy-phenyl)-(3-carboxy-4-keto-cyclohexa-2,5-dien-1-ylidene)methyl]-2-hydroxy-benzoic acid 5-[(3-carboxy-4-hydroxyphenyl)-(3-carboxy-4-oxocyclohexa-2,5-dien-1-ylidene)methyl]-2-hydroxybenzoic acid Aurintricarboxylic acid SMR000326731 | cid_2259
Type:
Small organic molecule
Emp. Form.:
C22H14O9
Mol. Mass.:
422.3412
SMILES:
[#8]-[#6](=O)-[#6]-1=[#6]\[#6](-[#6]=[#6]-[#6]-1=O)=[#6](\c1ccc(-[#8])c(c1)-[#6](-[#8])=O)-c1ccc(-[#8])c(c1)-[#6](-[#8])=O
: