Target
Bromodomain-containing protein 4
Ligand
BDBM50534821
Substrate
Meas. Tech.
ChEMBL_1929380 (CHEMBL4432556)
Ki
251±n/a nM
Citation
 Bradbury, RHCallis, RCarr, GRChen, HClark, EFeron, LGlossop, SGraham, MAHattersley, MJones, CLamont, SGOuvry, GPatel, APatel, JRabow, AARoberts, CAStokes, SStratton, NWalker, GEWard, LWhalley, DWhittaker, DWrigley, GWaring, MJ Optimization of a Series of Bivalent Triazolopyridazine Based Bromodomain and Extraterminal Inhibitors: The Discovery of (3R)-4-[2-[4-[1-(3-Methoxy-[1,2,4]triazolo[4,3-b]pyridazin-6-yl)-4-piperidyl]phenoxy]ethyl]-1,3-dimethyl-piperazin-2-one (AZD5153). J Med Chem 59:7801-17 (2016)  
Target
Name:
Bromodomain-containing protein 4
Synonyms:
BRD4 Bromodomain-containing protein 4 (BRD4) Protein HUNK1
Type:
Protein
Mol. Mass.:
152264.84
Organism:
Homo sapiens (Human)
Description:
O60885
Residue:
1362
  
Inhibitor
Name:
BDBM50534821
Synonyms:
CHEMBL2346974
Type:
Small organic molecule
Emp. Form.:
C25H30F3N7O2
Mol. Mass.:
517.5466
SMILES:
CC(=O)N1CCN(CCOc2ccc(cc2)C2CCN(CC2)c2ccc3nnc(n3n2)C(F)(F)F)CC1
: