Target
Bromodomain-containing protein 4
Ligand
BDBM50534823
Substrate
Meas. Tech.
ChEMBL_1929380 (CHEMBL4432556)
Ki
63±n/a nM
Citation
 Bradbury, RHCallis, RCarr, GRChen, HClark, EFeron, LGlossop, SGraham, MAHattersley, MJones, CLamont, SGOuvry, GPatel, APatel, JRabow, AARoberts, CAStokes, SStratton, NWalker, GEWard, LWhalley, DWhittaker, DWrigley, GWaring, MJ Optimization of a Series of Bivalent Triazolopyridazine Based Bromodomain and Extraterminal Inhibitors: The Discovery of (3R)-4-[2-[4-[1-(3-Methoxy-[1,2,4]triazolo[4,3-b]pyridazin-6-yl)-4-piperidyl]phenoxy]ethyl]-1,3-dimethyl-piperazin-2-one (AZD5153). J Med Chem 59:7801-17 (2016)  
Target
Name:
Bromodomain-containing protein 4
Synonyms:
BRD4 Bromodomain-containing protein 4 (BRD4) Protein HUNK1
Type:
Protein
Mol. Mass.:
152264.84
Organism:
Homo sapiens (Human)
Description:
O60885
Residue:
1362
  
Inhibitor
Name:
BDBM50534823
Synonyms:
CHEMBL4593653
Type:
Small organic molecule
Emp. Form.:
C27H37N7O3
Mol. Mass.:
507.6278
SMILES:
COc1nnc2ccc(nn12)N1CCC(CC1)c1ccc(OCCCCN2CCN(C)C(=O)[C@H]2C)cc1
: