Target
Botulinum neurotoxin type E
Ligand
BDBM50534915
Substrate
Meas. Tech.
ChEMBL_1929497 (CHEMBL4432673)
IC50
14200±n/a nM
Citation
 Zhou, YMcGillick, BETeng, YGHaranahalli, KOjima, ISwaminathan, SRizzo, RC Identification of small molecule inhibitors of botulinum neurotoxin serotype E via footprint similarity. Bioorg Med Chem 24:4875-4889 (2016)  
Target
Name:
Botulinum neurotoxin type E
Synonyms:
BXE_CLOBO Bontoxilysin-E Botulinum neurotoxin E light chain botE
Type:
PROTEIN
Mol. Mass.:
143842.39
Organism:
Clostridium botulinum
Description:
ChEMBL_103941
Residue:
1251
  
Inhibitor
Name:
BDBM50534915
Synonyms:
CHEMBL4546947
Type:
Small organic molecule
Emp. Form.:
C22H27N3O5S
Mol. Mass.:
445.532
SMILES:
CC(C)C[C@@H](NS(=O)(=O)c1ccc2oc(=O)n(C)c2c1)C(=O)Nc1cccc(C)c1C
: