Target
Prostaglandin G/H synthase 1
Ligand
BDBM50090631
Substrate
Meas. Tech.
ChEBML_158586
IC50
5280±n/a nM
Citation
 Bosch, JRoca, TCatena, JLLlorens, OPérez, JJLagunas, CFernández, AGMiquel, IFernández-Serrat, AFarrerons, C Synthesis and biological evaluation of 1,3,4-triaryl-3-pyrrolin-2-ones, a new class of selective cyclooxygenase-2 inhibitors. Bioorg Med Chem Lett 10:1745-8 (2000)  
Target
Name:
Prostaglandin G/H synthase 1
Synonyms:
COX-1 Cyclooxygenase Cyclooxygenase-1 (COX-1) PTGS1 | Prostaglandin G/H synthase (cyclooxygenase)
Type:
Enzyme
Mol. Mass.:
68692.62
Organism:
Homo sapiens (Human)
Description:
P23219
Residue:
599
  
Inhibitor
Name:
BDBM50090631
Synonyms:
3-(4-Fluoro-phenyl)-4-(4-methanesulfonyl-phenyl)-1-(4-methoxy-phenyl)-1,5-dihydro-pyrrol-2-one | CHEMBL49606
Type:
Small organic molecule
Emp. Form.:
C24H20FNO4S
Mol. Mass.:
437.483
SMILES:
COc1ccc(cc1)N1CC(=C(C1=O)c1ccc(F)cc1)c1ccc(cc1)S(C)(=O)=O
: