Target
Prostaglandin G/H synthase 2
Ligand
BDBM50090632
Substrate
Meas. Tech.
ChEBML_159599
IC50
1000±n/a nM
Citation
 Bosch, JRoca, TCatena, JLLlorens, OPérez, JJLagunas, CFernández, AGMiquel, IFernández-Serrat, AFarrerons, C Synthesis and biological evaluation of 1,3,4-triaryl-3-pyrrolin-2-ones, a new class of selective cyclooxygenase-2 inhibitors. Bioorg Med Chem Lett 10:1745-8 (2000)  
Target
Name:
Prostaglandin G/H synthase 2
Synonyms:
COX2 Cyclooxygenase 2 (COX-2) Cyclooxygenase-2 (COX-2 AA) Cyclooxygenase-2 (COX-2) PGH2_HUMAN PHS II Prostaglandin E synthase/G/H synthase 2 Prostaglandin-endoperoxide synthase 2
Type:
Enzyme
Mol. Mass.:
69003.89
Organism:
Homo sapiens (Human)
Description:
Recombinant Cox-2 provided by Cayman (Cayman Chemical Co.,Ann Arbor, MI).
Residue:
604
  
Inhibitor
Name:
BDBM50090632
Synonyms:
4-(4-Methanesulfonyl-phenyl)-3-phenyl-1-p-tolyl-1,5-dihydro-pyrrol-2-one | CHEMBL48758
Type:
Small organic molecule
Emp. Form.:
C24H21NO3S
Mol. Mass.:
403.493
SMILES:
Cc1ccc(cc1)N1CC(=C(C1=O)c1ccccc1)c1ccc(cc1)S(C)(=O)=O
: