Target
Prostaglandin G/H synthase 1
Ligand
BDBM22964
Substrate
Meas. Tech.
ChEMBL_159279 (CHEMBL764263)
IC50
>66000±n/a nM
Citation
 Kalgutkar, ASMarnett, ABCrews, BCRemmel, RPMarnett, LJ Ester and amide derivatives of the nonsteroidal antiinflammatory drug, indomethacin, as selective cyclooxygenase-2 inhibitors. J Med Chem 43:2860-70 (2000)  
Target
Name:
Prostaglandin G/H synthase 1
Synonyms:
COX1 Cyclooxygenase-1 (COX-1) PTGS1 | Prostaglandin G/H synthase (cyclooxygenase)
Type:
Protein
Mol. Mass.:
68868.60
Organism:
Ovis aries (Sheep)
Description:
Residue:
600
  
Inhibitor
Name:
BDBM22964
Synonyms:
2-{1-[(4-chlorophenyl)carbonyl]-5-methoxy-2-methyl-1H-indol-3-yl}-N-methyl-N-(2-phenylethyl)acetamide Indomethacin derivative, 17
Type:
Small organic molecule
Emp. Form.:
C28H27ClN2O3
Mol. Mass.:
474.979
SMILES:
COc1ccc2n(C(=O)c3ccc(Cl)cc3)c(C)c(CC(=O)N(C)CCc3ccccc3)c2c1
: