Target
Prostaglandin G/H synthase 1
Ligand
BDBM22959
Substrate
Meas. Tech.
ChEMBL_159279 (CHEMBL764263)
IC50
2500±n/a nM
Citation
 Kalgutkar, ASMarnett, ABCrews, BCRemmel, RPMarnett, LJ Ester and amide derivatives of the nonsteroidal antiinflammatory drug, indomethacin, as selective cyclooxygenase-2 inhibitors. J Med Chem 43:2860-70 (2000)  
Target
Name:
Prostaglandin G/H synthase 1
Synonyms:
COX1 Cyclooxygenase-1 (COX-1) PTGS1 | Prostaglandin G/H synthase (cyclooxygenase)
Type:
Protein
Mol. Mass.:
68868.60
Organism:
Ovis aries (Sheep)
Description:
Residue:
600
  
Inhibitor
Name:
BDBM22959
Synonyms:
CHEMBL96954 pyridin-3-yl 2-{1-[(4-chlorophenyl)carbonyl]-5-methoxy-2-methyl-1H-indol-3-yl}acetate
Type:
Small organic molecule
Emp. Form.:
C24H19ClN2O4
Mol. Mass.:
434.872
SMILES:
COc1ccc2n(C(=O)c3ccc(Cl)cc3)c(C)c(CC(=O)Oc3cccnc3)c2c1
: