Target
Caspase-1
Ligand
BDBM50091569
Substrate
Meas. Tech.
ChEMBL_46497 (CHEMBL659500)
IC50
1±n/a nM
Citation
 Talanian, RVBrady, KDCryns, VL Caspases as targets for anti-inflammatory and anti-apoptotic drug discovery. J Med Chem 43:3351-71 (2000)  
Target
Name:
Caspase-1
Synonyms:
CASP1 Caspase ICE IL1BCE Interleukin-1 beta-converting enzyme
Type:
Enzyme
Mol. Mass.:
45154.13
Organism:
Homo sapiens (Human)
Description:
P29466
Residue:
404
  
Inhibitor
Name:
BDBM50091569
Synonyms:
3-{[9-(2-Fluoro-benzoylamino)-6,10-dioxo-octahydro-pyridazino[1,2-a][1,2]diazepine-1-carbonyl]-amino}-4-oxo-butyric acid | CHEMBL325605
Type:
Small organic molecule
Emp. Form.:
C21H23FN4O7
Mol. Mass.:
462.4283
SMILES:
OC(=O)C[C@H](NC(=O)C1CCCN2N1C(=O)C(CCC2=O)NC(=O)c1ccccc1F)C=O
: