Target
Beta-2 adrenergic receptor
Ligand
BDBM50091777
Substrate
Meas. Tech.
ChEBML_38312
IC50
2100±n/a nM
Citation
 Mathvink, RJTolman, JSChitty, DCandelore, MRCascieri, MAColwell, LFDeng, LFeeney, WPForrest, MJHom, GJMacIntyre, DETota, LWyvratt, MJFisher, MHWeber, AE Potent, selective 3-pyridylethanolamine beta3 adrenergic receptor agonists possessing a thiazole benzenesulfonamide pharmacophore. Bioorg Med Chem Lett 10:1971-3 (2001)  
Target
Name:
Beta-2 adrenergic receptor
Synonyms:
ADRB2 ADRB2_HUMAN Beta-2 adrenoceptor | Beta-2 adrenoreceptor
Type:
Mol. Mass.:
46461.69
Organism:
Homo sapiens (Human)
Description:
P07550
Residue:
413
  
Inhibitor
Name:
BDBM50091777
Synonyms:
CHEMBL291594 | N-{4-[2-(4-{4-[2-((R)-2-Hydroxy-2-pyridin-3-yl-ethylamino)-ethyl]-phenylsulfamoyl}-phenyl)-thiazol-4-yl]-phenyl}-acetamide
Type:
Small organic molecule
Emp. Form.:
C32H31N5O4S2
Mol. Mass.:
613.75
SMILES:
CC(=O)Nc1ccc(cc1)-c1csc(n1)-c1ccc(cc1)S(=O)(=O)Nc1ccc(CCNC[C@H](O)c2cccnc2)cc1
: