Target
Beta-2 adrenergic receptor
Ligand
BDBM50091775
Substrate
Meas. Tech.
ChEBML_38312
IC50
90000±n/a nM
Citation
 Mathvink, RJTolman, JSChitty, DCandelore, MRCascieri, MAColwell, LFDeng, LFeeney, WPForrest, MJHom, GJMacIntyre, DETota, LWyvratt, MJFisher, MHWeber, AE Potent, selective 3-pyridylethanolamine beta3 adrenergic receptor agonists possessing a thiazole benzenesulfonamide pharmacophore. Bioorg Med Chem Lett 10:1971-3 (2001)  
Target
Name:
Beta-2 adrenergic receptor
Synonyms:
ADRB2 ADRB2_HUMAN Beta-2 adrenoceptor | Beta-2 adrenoreceptor
Type:
Mol. Mass.:
46461.69
Organism:
Homo sapiens (Human)
Description:
P07550
Residue:
413
  
Inhibitor
Name:
BDBM50091775
Synonyms:
4-[4-(4-Hexyl-phenyl)-thiazol-2-yl]-N-{4-[2-((R)-2-hydroxy-2-pyridin-3-yl-ethylamino)-ethyl]-phenyl}-benzenesulfonamide | CHEMBL58241
Type:
Small organic molecule
Emp. Form.:
C36H40N4O3S2
Mol. Mass.:
640.858
SMILES:
CCCCCCc1ccc(cc1)-c1csc(n1)-c1ccc(cc1)S(=O)(=O)Nc1ccc(CCNC[C@H](O)c2cccnc2)cc1
: