Target
Beta-2 adrenergic receptor
Ligand
BDBM50091780
Substrate
Meas. Tech.
ChEBML_38312
IC50
2000±n/a nM
Citation
 Mathvink, RJTolman, JSChitty, DCandelore, MRCascieri, MAColwell, LFDeng, LFeeney, WPForrest, MJHom, GJMacIntyre, DETota, LWyvratt, MJFisher, MHWeber, AE Potent, selective 3-pyridylethanolamine beta3 adrenergic receptor agonists possessing a thiazole benzenesulfonamide pharmacophore. Bioorg Med Chem Lett 10:1971-3 (2001)  
Target
Name:
Beta-2 adrenergic receptor
Synonyms:
ADRB2 ADRB2_HUMAN Beta-2 adrenoceptor | Beta-2 adrenoreceptor
Type:
Mol. Mass.:
46461.69
Organism:
Homo sapiens (Human)
Description:
P07550
Residue:
413
  
Inhibitor
Name:
BDBM50091780
Synonyms:
CHEMBL61429 | N-{4-[2-((R)-2-Hydroxy-2-pyridin-3-yl-ethylamino)-ethyl]-phenyl}-4-(4-naphthalen-2-ylmethyl-thiazol-2-ylmethyl)-benzenesulfonamide
Type:
Small organic molecule
Emp. Form.:
C36H34N4O3S2
Mol. Mass.:
634.81
SMILES:
O[C@@H](CNCCc1ccc(NS(=O)(=O)c2ccc(Cc3nc(Cc4ccc5ccccc5c4)cs3)cc2)cc1)c1cccnc1
: