Target
Beta-1 adrenergic receptor
Ligand
BDBM50091767
Substrate
Meas. Tech.
ChEBML_37379
IC50
50000±n/a nM
Citation
 Mathvink, RJTolman, JSChitty, DCandelore, MRCascieri, MAColwell, LFDeng, LFeeney, WPForrest, MJHom, GJMacIntyre, DETota, LWyvratt, MJFisher, MHWeber, AE Potent, selective 3-pyridylethanolamine beta3 adrenergic receptor agonists possessing a thiazole benzenesulfonamide pharmacophore. Bioorg Med Chem Lett 10:1971-3 (2001)  
Target
Name:
Beta-1 adrenergic receptor
Synonyms:
ADRB1 ADRB1_HUMAN Beta-1 adrenoceptor adrenergic Beta1
Type:
G Protein-Coupled Receptor (GPCR)
Mol. Mass.:
51338.40
Organism:
Homo sapiens (Human)
Description:
P08588
Residue:
477
  
Inhibitor
Name:
BDBM50091767
Synonyms:
CHEMBL294849 | N-{5-[2-(4-{4-[2-((R)-2-Hydroxy-2-pyridin-3-yl-ethylamino)-ethyl]-phenylsulfamoyl}-phenyl)-thiazol-4-yl]-pentyl}-acetamide
Type:
Small organic molecule
Emp. Form.:
C31H37N5O4S2
Mol. Mass.:
607.787
SMILES:
CC(=O)NCCCCCc1csc(n1)-c1ccc(cc1)S(=O)(=O)Nc1ccc(CCNC[C@H](O)c2cccnc2)cc1
: