Target
Beta-1 adrenergic receptor
Ligand
BDBM50091769
Substrate
Meas. Tech.
ChEBML_37379
IC50
850±n/a nM
Citation
 Mathvink, RJTolman, JSChitty, DCandelore, MRCascieri, MAColwell, LFDeng, LFeeney, WPForrest, MJHom, GJMacIntyre, DETota, LWyvratt, MJFisher, MHWeber, AE Potent, selective 3-pyridylethanolamine beta3 adrenergic receptor agonists possessing a thiazole benzenesulfonamide pharmacophore. Bioorg Med Chem Lett 10:1971-3 (2001)  
Target
Name:
Beta-1 adrenergic receptor
Synonyms:
ADRB1 ADRB1_HUMAN Beta-1 adrenoceptor adrenergic Beta1
Type:
G Protein-Coupled Receptor (GPCR)
Mol. Mass.:
51338.40
Organism:
Homo sapiens (Human)
Description:
P08588
Residue:
477
  
Inhibitor
Name:
BDBM50091769
Synonyms:
CHEMBL291593 | N-{4-[2-((R)-2-Hydroxy-2-pyridin-3-yl-ethylamino)-ethyl]-phenyl}-4-(4-octyl-thiazol-2-ylmethyl)-benzenesulfonamide
Type:
Small organic molecule
Emp. Form.:
C33H42N4O3S2
Mol. Mass.:
606.842
SMILES:
CCCCCCCCc1csc(Cc2ccc(cc2)S(=O)(=O)Nc2ccc(CCNC[C@H](O)c3cccnc3)cc2)n1
: