Target
Beta-1 adrenergic receptor
Ligand
BDBM50091784
Substrate
Meas. Tech.
ChEBML_37379
IC50
3300±n/a nM
Citation
 Mathvink, RJTolman, JSChitty, DCandelore, MRCascieri, MAColwell, LFDeng, LFeeney, WPForrest, MJHom, GJMacIntyre, DETota, LWyvratt, MJFisher, MHWeber, AE Potent, selective 3-pyridylethanolamine beta3 adrenergic receptor agonists possessing a thiazole benzenesulfonamide pharmacophore. Bioorg Med Chem Lett 10:1971-3 (2001)  
Target
Name:
Beta-1 adrenergic receptor
Synonyms:
ADRB1 ADRB1_HUMAN Beta-1 adrenoceptor adrenergic Beta1
Type:
G Protein-Coupled Receptor (GPCR)
Mol. Mass.:
51338.40
Organism:
Homo sapiens (Human)
Description:
P08588
Residue:
477
  
Inhibitor
Name:
BDBM50091784
Synonyms:
CHEMBL418308 | N-{4-[2-((R)-2-Hydroxy-2-pyridin-3-yl-ethylamino)-ethyl]-phenyl}-4-(4-naphthalen-2-ylmethyl-thiazol-2-yl)-benzenesulfonamide
Type:
Small organic molecule
Emp. Form.:
C35H32N4O3S2
Mol. Mass.:
620.784
SMILES:
O[C@@H](CNCCc1ccc(NS(=O)(=O)c2ccc(cc2)-c2nc(Cc3ccc4ccccc4c3)cs2)cc1)c1cccnc1
: