Target
ATP-dependent Clp protease proteolytic subunit
Ligand
BDBM50535809
Substrate
Meas. Tech.
ChEMBL_1931813 (CHEMBL4477465)
EC50
87500±n/a nM
Citation
 Lavey, NPCoker, JARuben, EADuerfeldt, AS Sclerotiamide: The First Non-Peptide-Based Natural Product Activator of Bacterial Caseinolytic Protease P. J Nat Prod 79:1193-7 (2016)  
Target
Name:
ATP-dependent Clp protease proteolytic subunit
Synonyms:
ATP-dependent Clp protease proteolytic subunit Caseinolytic protease Heat shock protein F21.5 Protease Ti lopP
Type:
PROTEIN
Mol. Mass.:
23183.39
Organism:
Escherichia coli (strain K12)
Description:
ChEMBL_109492
Residue:
207
  
Inhibitor
Name:
BDBM50535809
Synonyms:
Sclerotiamide
Type:
Small organic molecule
Emp. Form.:
C26H29N3O5
Mol. Mass.:
463.5256
SMILES:
[H][C@@]12C[C@]34CCCN3C(=O)[C@]1(NC4=O)[C@@H](O)[C@@]1(C(=O)Nc3c1ccc1OC(C)(C)C=Cc31)C2(C)C
: