Target
Histone acetyltransferase p300/Hypoxia-inducible factor 1-alpha
Ligand
BDBM50537295
Substrate
Meas. Tech.
ChEMBL_1936057 (CHEMBL4481816)
Ki
3500±n/a nM
Citation
 Li, JXi, WLi, XSun, HLi, Y Advances in inhibition of protein-protein interactions targeting hypoxia-inducible factor-1 for cancer therapy. Bioorg Med Chem 27:1145-1158 (2019)  
Target
Name:
Histone acetyltransferase p300/Hypoxia-inducible factor 1-alpha
Synonyms:
Type:
Mol. Mass.:
Description:
ASSAY_ID of ChEMBL is 1936068
Components:
This complex has 2 components.
Component 1
Name:
Histone acetyltransferase p300
Synonyms:
EP300 HIF1A/p300/CREB-binding protein P300
Type:
Protein
Mol. Mass.:
264223.04
Organism:
Homo sapiens (Human)
Description:
Q09472
Residue:
2414
  
Component 2
Name:
Hypoxia-inducible factor 1-alpha
Synonyms:
BHLHE78 HIF-1-alpha, HIF-2-alpha HIF1A_HUMAN Hypoxia-inducible factor 1 alpha MOP1 von Hippel-Lindau disease tumor suppressor/Elongin-C/Elongin-B/HIF1A
Type:
Protein
Mol. Mass.:
92647.24
Organism:
Homo sapiens (Human)
Description:
Q16665
Residue:
826
  
Inhibitor
Name:
BDBM50537295
Synonyms:
CHEMBL4524475
Type:
Small organic molecule
Emp. Form.:
C42H71N13O13
Mol. Mass.:
966.0924
SMILES:
CC(C)C[C@H](NC(=O)[C@H](C)NC(=O)[C@H](CCCNC(N)=N)N1C\C=C\CCN[C@@H](CC(O)=O)C(=O)N[C@@H](CC(C)C)C(=O)N[C@@H](C)C1=O)C(=O)N[C@@H](CC(O)=O)C(=O)N[C@@H](CCC(N)=O)C(N)=O
: