Target
Neuronal acetylcholine receptor subunit alpha-4/beta-2
Ligand
BDBM50093251
Substrate
Meas. Tech.
ChEMBL_143700 (CHEMBL756000)
Ki
2200±n/a nM
Citation
 Mullen, GNapier, JBalestra, MDeCory, THale, GMacor, JMack, RLoch, JWu, EKover, AVerhoest, PSampognaro, APhillips, EZhu, YMurray, RGriffith, RBlosser, JGurley, DMachulskis, AZongrone, JRosen, AGordon, J (-)-Spiro[1-azabicyclo[2.2.2]octane-3,5'-oxazolidin-2'-one], a conformationally restricted analogue of acetylcholine, is a highly selective full agonist at the alpha 7 nicotinic acetylcholine receptor. J Med Chem 43:4045-50 (2000)  
Target
Name:
Neuronal acetylcholine receptor subunit alpha-4/beta-2
Synonyms:
Neuronal acetylcholine receptor alpha4/beta2 Neuronal acetylcholine receptor; alpha4/beta2
Type:
Mol. Mass.:
Description:
Components:
This complex has 0 components.
Component 1
Name:
Neuronal acetylcholine receptor subunit alpha-4
Synonyms:
ACHA4_RAT Cholinergic, Nicotinic Alpha4Beta2 Chrna4 Neuronal acetylcholine receptor (alpha4beta2 nAChR) Neuronal acetylcholine receptor subunit alpha 4 beta 2 | Neuronal acetylcholine receptor subunit alpha-4
Type:
Enzyme
Mol. Mass.:
70196.44
Organism:
Rattus norvegicus (Rat)
Description:
P09483
Residue:
630
  
Component 2
Name:
Neuronal acetylcholine receptor subunit beta-2
Synonyms:
ACHB2_RAT Chrnb2 Neuronal acetylcholine receptor non-alpha-1 chain
Type:
Enzyme
Mol. Mass.:
56910.32
Organism:
Rattus norvegicus (Rat)
Description:
P12390
Residue:
500
  
Inhibitor
Name:
BDBM50093251
Synonyms:
CHEMBL338698 | Spiro[1-azabicyclo[2.2.2]octane-3,5'-dioxazolan-2'-one]
Type:
Small organic molecule
Emp. Form.:
C9H13NO3
Mol. Mass.:
183.2044
SMILES:
O=C1OCC2(CN3CCC2CC3)O1
: