Target
Neuronal acetylcholine receptor subunit alpha-7
Ligand
BDBM50093255
Substrate
Meas. Tech.
ChEMBL_217795 (CHEMBL824055)
Ki
92±n/a nM
Citation
 Mullen, GNapier, JBalestra, MDeCory, THale, GMacor, JMack, RLoch, JWu, EKover, AVerhoest, PSampognaro, APhillips, EZhu, YMurray, RGriffith, RBlosser, JGurley, DMachulskis, AZongrone, JRosen, AGordon, J (-)-Spiro[1-azabicyclo[2.2.2]octane-3,5'-oxazolidin-2'-one], a conformationally restricted analogue of acetylcholine, is a highly selective full agonist at the alpha 7 nicotinic acetylcholine receptor. J Med Chem 43:4045-50 (2000)  
Target
Name:
Neuronal acetylcholine receptor subunit alpha-7
Synonyms:
ACHA7_RAT Cholinergic, Nicotinic Alpha7 Chrna7 Neuronal acetylcholine receptor (alpha7 nAChR) Neuronal acetylcholine receptor subunit alpha-7 Neuronal acetylcholine receptor subunit alpha-7 (nAChR)
Type:
Enzyme
Mol. Mass.:
56502.44
Organism:
Rattus norvegicus (Rat)
Description:
Q05941
Residue:
502
  
Inhibitor
Name:
BDBM50093255
Synonyms:
(+)-Spiro[1-azabicyclo[2.2.2]octane-3,5'-oxazolidin-2'-one] 1'-azaspiro[oxazolidine-5,3'-bicyclo[2.2.2]octan]-2-one CHEMBL293975 | Spiro[1-azabicyclo[2.2.2]octane-3,5'-oxazolidin-2'-one]
Type:
Small organic molecule
Emp. Form.:
C9H14N2O2
Mol. Mass.:
182.2197
SMILES:
O=C1NCC2(CN3CCC2CC3)O1
: