Target
Neuronal acetylcholine receptor subunit alpha-7
Ligand
BDBM82070
Substrate
Meas. Tech.
ChEMBL_144176 (CHEMBL749557)
Ki
480±n/a nM
Citation
 Mullen, GNapier, JBalestra, MDeCory, THale, GMacor, JMack, RLoch, JWu, EKover, AVerhoest, PSampognaro, APhillips, EZhu, YMurray, RGriffith, RBlosser, JGurley, DMachulskis, AZongrone, JRosen, AGordon, J (-)-Spiro[1-azabicyclo[2.2.2]octane-3,5'-oxazolidin-2'-one], a conformationally restricted analogue of acetylcholine, is a highly selective full agonist at the alpha 7 nicotinic acetylcholine receptor. J Med Chem 43:4045-50 (2000)  
Target
Name:
Neuronal acetylcholine receptor subunit alpha-7
Synonyms:
ACHA7_RAT Cholinergic, Nicotinic Alpha7 Chrna7 Neuronal acetylcholine receptor (alpha7 nAChR) Neuronal acetylcholine receptor subunit alpha-7 Neuronal acetylcholine receptor subunit alpha-7 (nAChR)
Type:
Enzyme
Mol. Mass.:
56502.44
Organism:
Rattus norvegicus (Rat)
Description:
Q05941
Residue:
502
  
Inhibitor
Name:
BDBM82070
Synonyms:
CAS_29790-52-1 Nicotine-D salicylate US9303017, Nicotine
Type:
Emp. Form.:
C10H14N2
Mol. Mass.:
162.2316
SMILES:
CN1CCC[C@H]1c1cccnc1
: