Target
Neuronal acetylcholine receptor subunit alpha-3/beta-4
Ligand
BDBM50538046
Substrate
Meas. Tech.
ChEMBL_1971866 (CHEMBL4604684)
Ki
8.2±n/a nM
Citation
 Nirogi, RMohammed, ARShinde, AKRavella, SRBogaraju, NSubramanian, RMekala, VRPalacharla, RCMuddana, NThentu, JBBhyrapuneni, GAbraham, RJasti, V Discovery and Development of 3-(6-Chloropyridine-3-yloxymethyl)-2-azabicyclo[3.1.0]hexane Hydrochloride (SUVN-911): A Novel, Potent, Selective, and Orally Active Neuronal Nicotinic Acetylcholine ?4?2 Receptor Antagonist for the Treatment of Depression. J Med Chem 63:2833-2853 (2020)  
Target
Name:
Neuronal acetylcholine receptor subunit alpha-3/beta-4
Synonyms:
Neuronal acetylcholine receptor protein alpha-3/beta-4 subunit | Neuronal acetylcholine receptor; alpha3/beta4
Type:
Mol. Mass.:
Description:
ASSAY_ID of ChEMBL is 1970247
Components:
This complex has 2 components.
Component 1
Name:
Neuronal acetylcholine receptor subunit beta-4
Synonyms:
ACHB4_HUMAN Cholinergic, Nicotinic Alpha6Beta3Beta4Alpha5 Nicotinic acetylcholine receptor alpha6/alpha3/beta4
Type:
Enzyme Catalytic Domain
Mol. Mass.:
56388.51
Organism:
Homo sapiens (Human)
Description:
Cholinergic, Nicotinic Alpha6Beta3Beta4Alpha5 0 HUMAN::P30926
Residue:
498
  
Component 2
Name:
Neuronal acetylcholine receptor subunit alpha-3
Synonyms:
ACHA3_HUMAN Cholinergic, Nicotinic Alpha3Beta2 Cholinergic, Nicotinic Alpha3Beta4x NACHRA3 Neuronal acetylcholine receptor subunit alpha-3 nicotinic central
Type:
Enzyme Catalytic Domain
Mol. Mass.:
57479.03
Organism:
Homo sapiens (Human)
Description:
Cholinergic, Nicotinic Alpha3Beta2 0 HUMAN::P32297
Residue:
505
  
Inhibitor
Name:
BDBM50538046
Synonyms:
CHEMBL4647198
Type:
Small organic molecule
Emp. Form.:
C11H14Cl2N2O
Mol. Mass.:
261.148
SMILES:
Cl.[H][C@@]12C[C@]1([H])[C@@H](COc1cncc(Cl)c1)NC2
: