Target
Muscarinic acetylcholine receptor M2
Ligand
BDBM50093889
Substrate
Meas. Tech.
ChEBML_139909
EC50
507±n/a nM
Citation
 Zlotos, DPBuller, STränkle, CMohr, K Bisquaternary caracurine V derivatives as allosteric modulators of ligand binding to M2 acetylcholine receptors. Bioorg Med Chem Lett 10:2529-32 (2001)  
Target
Name:
Muscarinic acetylcholine receptor M2
Synonyms:
ACM2_PIG Cholinergic, muscarinic LOC100715343 Muscarinic receptor 2
Type:
Enzyme Catalytic Domain
Mol. Mass.:
51688.65
Organism:
GUINEA PIG
Description:
Cholinergic, muscarinic 0 GUINEA PIG::P06199
Residue:
466
  
Inhibitor
Name:
BDBM50093889
Synonyms:
CHEMBL407071 | Caracurine V derivative
Type:
Small organic molecule
Emp. Form.:
C52H52Br2N4O2
Mol. Mass.:
924.802
SMILES:
Brc1ccc(C[N+]23CCC45[C@@H]2C[C@@H]2[C@@H]6[C@@H]4N([C@@H]4OCC=C7C[N+]8(Cc9ccc(Br)cc9)CCC9%10[C@@H]8C[C@@H]7[C@@H]4[C@@H]9N([C@@H]6OCC=C2C3)c2ccccc%102)c2ccccc52)cc1
: