Target
Kelch-like ECH-associated protein 1
Ligand
BDBM50519234
Substrate
Meas. Tech.
ChEMBL_1972921 (CHEMBL4605739)
IC50
63±n/a nM
Citation
 Lazzara, PRJain, ADMaldonado, ACRichardson, BSkowron, KJDavid, BPSiddiqui, ZRatia, KMMoore, TW Synthesis and Evaluation of Noncovalent Naphthalene-Based KEAP1-NRF2 Inhibitors. ACS Med Chem Lett 11:521-527 (2020)  
Target
Name:
Kelch-like ECH-associated protein 1
Synonyms:
Cytosolic inhibitor of Nrf2 KEAP1 KEAP1_HUMAN KLHL19 | Kelch-like protein 19
Type:
PROTEIN
Mol. Mass.:
69664.53
Organism:
Homo sapiens (Human)
Description:
ChEMBL_107924
Residue:
624
  
Inhibitor
Name:
BDBM50519234
Synonyms:
CHEMBL4440989
Type:
Small organic molecule
Emp. Form.:
C28H37N3O3
Mol. Mass.:
463.6117
SMILES:
CCCCC1CCCN1C(=O)[C@@H]1CCC[C@@H](C1)c1cccc(c1)-n1ncc(C(O)=O)c1C1CC1
: