Target
Arginase-1
Ligand
BDBM130381
Substrate
Meas. Tech.
ChEMBL_1973101 (CHEMBL4605919)
IC50
18±n/a nM
Citation
 Mitcheltree, MJLi, DAchab, ABeard, AChakravarthy, KCheng, MCho, HEangoor, PFan, PGathiaka, SKim, HYLesburg, CALyons, TWMartinot, TAMiller, JRMcMinn, SO'Neil, JPalani, APalte, RLSaurí, JSloman, DLZhang, HCumming, JNFischer, C Discovery and Optimization of Rationally Designed Bicyclic Inhibitors of Human Arginase to Enhance Cancer Immunotherapy. ACS Med Chem Lett 11:582-588 (2020)  
Target
Name:
Arginase-1
Synonyms:
ARG1 Liver-type arginase | Type I arginase
Type:
PROTEIN
Mol. Mass.:
34737.53
Organism:
Homo sapiens (Human)
Description:
ChEMBL_978893
Residue:
322
  
Inhibitor
Name:
BDBM130381
Synonyms:
(R)-2-amino-6-borono-2-[1-(3,4-dichlorobenzyl)piperidin-4-yl]hexanoic acid (ABH-DP)
Type:
Small organic molecule
Emp. Form.:
C18H27BCl2N2O4
Mol. Mass.:
417.135
SMILES:
N[C@](CCCCB(O)O)(C1CCN(Cc2ccc(Cl)c(Cl)c2)CC1)C(O)=O
: