Target
Arginase-1
Ligand
BDBM290372
Substrate
Meas. Tech.
ChEMBL_1973101 (CHEMBL4605919)
IC50
113±n/a nM
Citation
 Mitcheltree, MJLi, DAchab, ABeard, AChakravarthy, KCheng, MCho, HEangoor, PFan, PGathiaka, SKim, HYLesburg, CALyons, TWMartinot, TAMiller, JRMcMinn, SO'Neil, JPalani, APalte, RLSaurí, JSloman, DLZhang, HCumming, JNFischer, C Discovery and Optimization of Rationally Designed Bicyclic Inhibitors of Human Arginase to Enhance Cancer Immunotherapy. ACS Med Chem Lett 11:582-588 (2020)  
Target
Name:
Arginase-1
Synonyms:
ARG1 Liver-type arginase | Type I arginase
Type:
PROTEIN
Mol. Mass.:
34737.53
Organism:
Homo sapiens (Human)
Description:
ChEMBL_978893
Residue:
322
  
Inhibitor
Name:
BDBM290372
Synonyms:
(3R,4S)-3-amino-4-(3-boronopropyl)pyrrolidine-3-carboxylic acid US10603330, Example 8 | US11389464, Example 8
Type:
Small organic molecule
Emp. Form.:
C8H17BN2O4
Mol. Mass.:
216.043
SMILES:
N[C@]1(CNC[C@@H]1CCCB(O)O)C(O)=O
: