Target
Arginase-1
Ligand
BDBM50538522
Substrate
Meas. Tech.
ChEMBL_1973101 (CHEMBL4605919)
IC50
12±n/a nM
Citation
 Mitcheltree, MJLi, DAchab, ABeard, AChakravarthy, KCheng, MCho, HEangoor, PFan, PGathiaka, SKim, HYLesburg, CALyons, TWMartinot, TAMiller, JRMcMinn, SO'Neil, JPalani, APalte, RLSaurí, JSloman, DLZhang, HCumming, JNFischer, C Discovery and Optimization of Rationally Designed Bicyclic Inhibitors of Human Arginase to Enhance Cancer Immunotherapy. ACS Med Chem Lett 11:582-588 (2020)  
Target
Name:
Arginase-1
Synonyms:
ARG1 Liver-type arginase | Type I arginase
Type:
PROTEIN
Mol. Mass.:
34737.53
Organism:
Homo sapiens (Human)
Description:
ChEMBL_978893
Residue:
322
  
Inhibitor
Name:
BDBM50538522
Synonyms:
CHEMBL4633222
Type:
Small organic molecule
Emp. Form.:
C12H23BN2O4
Mol. Mass.:
270.133
SMILES:
N[C@]1(C[C@]2(CCCN2)C[C@@H]1CCCB(O)O)C(O)=O
: