Target
Arginase-1
Ligand
BDBM290365
Substrate
Meas. Tech.
ChEMBL_1973101 (CHEMBL4605919)
IC50
14±n/a nM
Citation
 Mitcheltree, MJLi, DAchab, ABeard, AChakravarthy, KCheng, MCho, HEangoor, PFan, PGathiaka, SKim, HYLesburg, CALyons, TWMartinot, TAMiller, JRMcMinn, SO'Neil, JPalani, APalte, RLSaurí, JSloman, DLZhang, HCumming, JNFischer, C Discovery and Optimization of Rationally Designed Bicyclic Inhibitors of Human Arginase to Enhance Cancer Immunotherapy. ACS Med Chem Lett 11:582-588 (2020)  
Target
Name:
Arginase-1
Synonyms:
ARG1 Liver-type arginase | Type I arginase
Type:
PROTEIN
Mol. Mass.:
34737.53
Organism:
Homo sapiens (Human)
Description:
ChEMBL_978893
Residue:
322
  
Inhibitor
Name:
BDBM290365
Synonyms:
(1S,2S)-1-amino-2-(3-boronopropyl)cyclopentanecarboxylic acid US10603330, Example 1 | US11389464, Example 1
Type:
Small organic molecule
Emp. Form.:
C9H18BNO4
Mol. Mass.:
215.055
SMILES:
N[C@]1(CCC[C@@H]1CCCB(O)O)C(O)=O
: