Target
Arginase-1
Ligand
BDBM50538529
Substrate
Meas. Tech.
ChEMBL_1973101 (CHEMBL4605919)
IC50
81±n/a nM
Citation
 Mitcheltree, MJLi, DAchab, ABeard, AChakravarthy, KCheng, MCho, HEangoor, PFan, PGathiaka, SKim, HYLesburg, CALyons, TWMartinot, TAMiller, JRMcMinn, SO'Neil, JPalani, APalte, RLSaurí, JSloman, DLZhang, HCumming, JNFischer, C Discovery and Optimization of Rationally Designed Bicyclic Inhibitors of Human Arginase to Enhance Cancer Immunotherapy. ACS Med Chem Lett 11:582-588 (2020)  
Target
Name:
Arginase-1
Synonyms:
ARG1 Liver-type arginase | Type I arginase
Type:
PROTEIN
Mol. Mass.:
34737.53
Organism:
Homo sapiens (Human)
Description:
ChEMBL_978893
Residue:
322
  
Inhibitor
Name:
BDBM50538529
Synonyms:
CHEMBL4637242
Type:
Small organic molecule
Emp. Form.:
C12H23BN2O4
Mol. Mass.:
270.133
SMILES:
[H][C@@]12CN[C@@H](C)[C@]1([H])C[C@](N)([C@H]2CCCB(O)O)C(O)=O
: